{"text_format":"1","workbook":"xlsx","n_sheets":8,"sheets":["Title","Dashboard","Simulation (Single run)","Simulation (Multiple runs)","Cost_Estimation","TC_vs_DD","Chart1","Chart2"],"not_rendered":{"charts":8,"images":2,"macros":1,"external_links":0,"defined_names":0,"comments":0,"pivot_tables":0},"unopened":[{"sheet":"Chart1","index":6,"reason":"not_a_worksheet"},{"sheet":"Chart2","index":7,"reason":"not_a_worksheet"}],"bounds":{"document_bytes":16777216,"sheet_cells":100000,"rows_first":2000,"rows_last":500,"rows_between":2000,"halvings":0,"cell_chars":16384,"cell_head_chars":4096},"cells_cut":0,"cells_raw":0,"read":"whole","date_system":"1904"}

{"sheet":"Title","index":0,"n_rows":0,"n_cols":0,"rows_kept":0,"cut":false,"hidden":false,"merged":[]}

{"sheet":"Dashboard","index":1,"n_rows":25,"n_cols":20,"rows_kept":25,"cut":false,"hidden":false,"merged":[[20,5,20,9],[3,1,3,10],[3,17,3,20],[21,18,21,19],[3,12,3,15],[5,5,5,9],[5,18,5,19],[6,5,7,5],[6,6,7,6],[5,2,5,3],[12,2,12,3],[16,2,16,3],[18,18,18,19]]}
[]
[null,null,"POWER (Pen-size Optimization Workbook for Experimental Research design)"]
[]
[null,"INPUTS",null,null,null,null,null,null,null,null,null,null,"Simulation Settings",null,null,null,null,"Outputs"]
[]
[null,null,"Statistical Settings / Assumptions",null,null,"Feed Consumption Data",null,null,null,null,null,null,null,"# Simulations",100,null,null,null,"Single Run"]
[null,null,"Population Mean",2475.2800000000002,null,"Age (Days)","Cumulative\nConsumption",null,null,null,null,null,null,"Treated Group Mean",{"$f":"D7","v":2475.2800000000002},null,null,null,"Treatment #1 (Control)"]
[null,null,"Population Standard Deviation",156.38,null,null,null,null,null,null,null,null,null,null,null,null,null,null,"  Estimated Mean ",2450.118505024464]
[null,null,"CV",{"$f":"D8/D7*100","v":6.3176691121812469},null,0,0,null,null,null,null,null,null,null,null,null,null,null,"  Estimated Standard Deviation",34.744887470067042]
[null,null,"Type I Error",0.05,null,7,140]
[null,null,"Type II Error",0.8,null,14,431,null,null,null,null,null,null,null,null,null,null,null,"Treatment #2 (Treated)"]
[null,null,null,null,null,21,984,null,null,null,null,null,null,null,null,null,null,null,"  Estimated Mean",2474.9777317213934]
[null,null,"Experimental Settings",null,null,28,1815,null,null,null,null,null,null,null,null,null,null,null,"  Estimated Standard Deviation",42.121345543357023]
[null,null,"Number of Birds / Pen",15,null,35,2871]
[null,null,"Replications",5,null,42,4055,null,null,null,null,null,null,null,null,null,null,null,"P-value (t-test)",0.33845899855090178]
{"$rows_left_out":11}
{"sheet":"Simulation (Single run)","index":2,"n_rows":27,"n_cols":12,"rows_kept":27,"cut":false,"hidden":false,"merged":[]}
[null,"Control",null,null,null,null,null,"Treated"]
[null,"Rep. 1","Rep. 2","Rep. 3","Rep. 4","Rep. 5",null,"Rep. 1","Rep. 2","Rep. 3","Rep. 4","Rep. 5"]
["Bird #1",2559.7914333126987,2624.3698142330472,2439.7259701989174,2480.6659794789439,2249.0035767699655,null,2488.3971309606977,2621.1898765847282,2440.8086234694988,2460.7477821078319,2279.6361189978265]
["Bird #2",2506.6595450186951,2510.5268703824781,2563.0684781785485,2416.4870947290283,2407.2173017790337,null,2388.5417404037626,2819.3010621106537,2404.844359001308,2437.6152569654091,2297.8351401503951]
["Bird #3",2394.1491151245027,2685.8796119049421,2528.4937042631873,2379.3213232212775,1929.4635424670942,null,2593.2763293685603,2358.1188959345263,2347.8439485688696,2226.1853331913908,2489.7232866743225]
["Bird #4",2131.7456197682204,2555.0968588393689,2335.682256629766,2366.7543049528422,2538.5261384048931,null,2586.0958859331554,2796.4557125048318,2508.1970798154107,2793.5237810895524,2492.5680363004381]
["Bird #5",2615.1719896408049,2366.7972843335078,2256.3041083235421,2233.3401925185021,2622.9006724760156,null,2561.379112463972,2488.5737857197632,2458.7747827921457,2431.7188669532179,2257.5291619713835]
["Bird #6",2210.7338603284988,2280.419850699891,2680.9055383622499,2421.3073639091567,2339.0990288490702,null,2441.3168547964651,2982.8710257493076,2375.3324140796763,2471.3184535528794,2547.9438948273082]
["Bird #7",2646.0725008775676,2546.7506271259695,2598.8074025499545,2316.9541174495012,2457.2904903074468,null,2601.6487906932498,2138.7710426805293,2427.0579836358033,2465.2614901738962,2417.978096338858]
["Bird #8",2424.8471199406786,2504.9276933940491,2388.5886327188127,2373.3527536377428,2313.189857336652,null,2752.6692676105417,2274.9175041973617,2694.3517777610168,2526.6585649738258,2559.2694527342819]
["Bird #9",2652.4979894833536,2277.5351572430172,2527.8974495377629,2491.8016401068639,2704.659580052537,null,2227.0780645880868,2606.2706175449725,2526.1996184818518,2317.3718185538401,2487.134244625513]
["Bird #10",2731.8323397206809,2386.2086072489974,2447.0838247275969,2716.5235071430484,2265.2668808265353,null,2420.9008151835592,2211.2185513480604,2273.0519851261047,2537.4405430067686,2584.5922761252623]
["Bird #11",2485.0344107965398,2391.366889661093,2499.3010277795843,2477.6662568075831,2436.4067431954268,null,2589.338543508768,2428.3340661843654,2554.81559124457,2431.7922134641799,2460.3124435525192]
["Bird #12",2223.229291463178,2393.7104239019222,2688.5836623074351,2281.2737431160408,2472.208833158611,null,2511.8530740669385,2730.3598629860326,2627.4967921738271,2598.1567874905354,2347.8800926397198]
["Bird #13",2462.9982507377877,2795.8961437689686,2162.1689483524292,2459.4326552282778,2406.3723344175846,null,2392.4479795440166,2436.2176227559798,2492.3103712124489,2582.578826954908,2270.7279593560893]
{"$rows_left_out":13}
{"sheet":"Simulation (Multiple runs)","index":3,"n_rows":108,"n_cols":21,"rows_kept":108,"cut":false,"hidden":false,"merged":[[6,0,7,0]]}
[]
[null,"Pr(Reject Null Hypothesis) =",null,null,5,{"$f":"E2/Dashboard!$O$6*100","v":5},"%",null,null,null,null,null,"# If the population mean of treated group is",{"$f":" Dashboard!$O$7","v":2475.2800000000002}]
[null,"Null Hypothesis : ",null,null,"Treated = Control"]
[]
[]
[null,"Replications"]
["Experiment Simulations","Controlled",null,null,null,null,null,null,null,"Treated"]
[null,1,2,3,4,5,"Aver.","Std.",null,1,2,3,4,5,"Aver.","Std.",null,"Difference","t-Value","P-Value","< 0.05"]
["Exp. #1",2427.7176561930701,2485.549971677201,2465.4832026292552,2456.3486992783032,2455.2593690920503,2458.0717797739758,20.870024542471814,null,2469.4782750913537,2521.122594053571,2457.5170029140722,2482.1407610530118,2480.3485434735335,2482.1214353171081,23.924158794665683,null,24.049655543132303,1.6938701724926217,0.12874137519565124,0]
["Exp. #2",2549.555781623566,2506.6582769714482,2530.3690795092584,2502.4125067909781,2453.8813756581353,2508.575404110677,36.011973899962037,null,2429.1820784122528,2430.175578207492,2430.6758155648995,2445.0087891588746,2439.2926705976483,2434.8669863882333,6.9702267976750694,null,-73.708417722443755,-4.4933360709351851,2.0198150607420719E-3,1]
["Exp. #3",2517.8837352532432,2488.9828127321566,2449.9239787402971,2508.9648548363202,2500.6708779402597,2493.2852519004555,26.477319522330671,null,2488.8847914875887,2472.6998892710271,2447.082107527594,2442.5526636598852,2476.2752466079928,2465.4989397108175,19.878328781027548,null,-27.786312189638011,-1.876600062525801,9.7413548106823122E-2,0]
["Exp. #4",2477.0510734652057,2482.3622794287116,2514.7719294522735,2458.7136372278424,2443.1012504780551,2475.2000340104178,27.03142707334467,null,2474.2463637818541,2438.5550408310041,2433.8072177252966,2472.6197587627744,2396.3653967108071,2443.1187555623474,32.142829590125999,null,-32.081278448070407,-1.7080660839876747,0.12600446324588471,0]
["Exp. #5",2499.3661386599142,2438.6569623586129,2518.7287039512898,2429.2073753160898,2487.0467094000583,2474.6011779371929,38.948738859810987,null,2555.6329738966965,2459.0271802329225,2453.8913755142776,2407.9639966631116,2453.2669132174301,2465.9564879048876,54.220864821178232,null,-8.6446900323053342,-0.28954606628247609,0.77952586295208914,0]
["Exp. #6",2495.6635976529624,2531.8320994954429,2472.5860404756208,2547.56486259848,2453.730891392775,2500.2754983230561,39.327087322534119,null,2452.732261403602,2468.6747660303567,2562.2021889129423,2520.3357919952546,2510.0576162475163,2502.8005249179346,43.47443812865319,null,2.5250265948784545,9.6312692376922138E-2,0.92564126010043846,0]
["Exp. #7",2398.9462163971752,2425.1561043706379,2449.0268270337224,2468.8078218829469,2512.3049084668755,2450.8483756302717,43.176070087564682,null,2478.9803231735191,2489.2836665209693,2492.0397924240951,2442.063036636147,2517.3270717502351,2483.9387781009927,27.327350843941748,null,33.090402470721074,1.4480620796815462,0.18562949311866545,0]
{"$rows_left_out":94}
{"sheet":"Cost_Estimation","index":4,"n_rows":28,"n_cols":8,"rows_kept":28,"cut":false,"hidden":false,"merged":[[22,2,22,3],[23,2,23,3],[25,1,25,3],[26,1,26,3],[27,1,27,3],[21,2,21,3],[16,2,16,3],[17,2,17,3],[18,2,18,3],[19,2,19,3],[20,2,20,3]]}
[null,"EXPEIMENTAL COSTS PLANNING SPREADSHEET "]
[null,null,"Enter coefficients for the equation:  Consumption = b0 + b1 x Age + b2 x Age2 + b3 x Age3"]
[]
[null,null,null,null,"b0",{"$f":"INDEX(LINEST(Dashboard!G9:G16,Dashboard!F9:F16^{1,2,3}),1,4)","v":29.227272727272407}]
[null,"DON’T OVERWRITE THIS SHEET",null,null,"b1",{"$f":"INDEX(LINEST(Dashboard!G9:G16,Dashboard!F9:F16^{1,2,3}),1,3)","v":-14.755668934240402}]
[null,"VALUES COME FROM THE DASHBOARD",null,null,"b2",{"$f":"INDEX(LINEST(Dashboard!G9:G16,Dashboard!F9:F16^{1,2,3}),1,2)","v":3.3063874900609629}]
[null,null,null,null,"b3",{"$f":"INDEX(LINEST(Dashboard!G9:G16,Dashboard!F9:F16^{1,2,3}),1)","v":-1.6572429837736005E-2}]
[]
[null,"FEED COSTS","Starter","Grower","Finisher ","Withdrawal","Total"]
[null,"Age at Start (Days)",{"$f":"Dashboard!G23","v":0},{"$f":"Dashboard!H23","v":17},{"$f":"Dashboard!I23","v":25},{"$f":"Dashboard!J23","v":32}]
[null,"Age at End (Days)",{"$f":"Dashboard!G24","v":17},{"$f":"Dashboard!H24","v":25},{"$f":"Dashboard!I24","v":32},{"$f":"Dashboard!J24","v":40}]
[null,"Consumption (Kg)",{"$f":"(($F4+$F$5*C11+$F$6*C11*C11+$F$7*C11*C11*C11)-($F$4+$F$5*C10+$F$6*C10*C10+$F$7*C10*C10*C10))/1000","v":0.62327926495273445},{"$f":"(($F4+$F$5*D11+$F$6*D11*D11+$F$7*D11*D11*D11)-($F$4+$F$5*D10+$F$6*D10*D10+$F$7*D10*D10*D10))/1000","v":0.81537697676473253},{"$f":"(($F4+$F$5*E11+$F$6*E11*E11+$F$7*E11*E11*E11)-($F$4+$F$5*E10+$F$6*E10*E10+$F$7*E10*E10*E10))/1000","v":0.9318577612863328},{"$f":"(($F4+$F$5*F11+$F$6*F11*F11+$F$7*F11*F11*F11)-($F$4+$F$5*F10+$F$6*F10*F10+$F$7*F10*F10*F10))/1000","v":1.2688437141090203}]
[null,"$/ton (1000 Kg)",{"$f":"Dashboard!G25","v":450},{"$f":"Dashboard!H25","v":425},{"$f":"Dashboard!I25","v":400},{"$f":"Dashboard!J25","v":350}]
[null,"Feed Cost per bird",{"$f":"C12*C13/1000","v":0.28047566922873052},{"$f":"D12*D13/1000","v":0.34653521512501134},{"$f":"E12*E13/1000","v":0.37274310451453313},{"$f":"F12*F13/1000","v":0.44409529993815711}]
[null,"TOTAL",null,null,null,null,{"$f":"SUM(C14:F14)","v":1.443849288806432}]
{"$rows_left_out":14}
{"sheet":"TC_vs_DD","index":5,"n_rows":103,"n_cols":20,"rows_kept":103,"cut":false,"hidden":false,"merged":[]}
[]
[null,"Reps","Birds","Total Birds","TC","DD",null,null,null,null,null,null,null,null,null,"Reps","Birds","Total Birds","TC","DD"]
[null,2,60,{"$f":"B3*C3","v":120},{"$f":"D3*Dashboard!$D$19+D3*Cost_Estimation!$G$15+(Cost_Estimation!$G$22*Cost_Estimation!$E$20*Cost_Estimation!$E$27+Cost_Estimation!$E$23*Cost_Estimation!$E$22*Cost_Estimation!$E$27+Cost_Estimation!$G$22*Cost_Estimation!$E$21*Cost_Estimation!$E$27)/60*Cost_Estimation!$E$24 + D3*Cost_Estimation!$G$22*Cost_Estimation!$E$17*Cost_Estimation!$E$19/52*3","v":340.21429560915283},{"$f":"SQRT(2*(Dashboard!$D$8)^2/(C3*B3))*(TINV(Dashboard!$D$10,B3-1)+TINV(2*(1-Dashboard!$D$11),B3-1))","v":284.30730324761151},null,null,null,null,null,null,null,null,null,2,5,{"$f":"P3*Q3","v":10},{"$f":"R3*Dashboard!$D$19+R3*Cost_Estimation!$G$15+(Cost_Estimation!$G$22*Cost_Estimation!$E$20*Cost_Estimation!$E$27+Cost_Estimation!$E$23*Cost_Estimation!$E$22*Cost_Estimation!$E$27+Cost_Estimation!$G$22*Cost_Estimation!$E$21*Cost_Estimation!$E$27)/60*Cost_Estimation!$E$24 + R3*Cost_Estimation!$G$22*Cost_Estimation!$E$17*Cost_Estimation!$E$19/52*3","v":148.39087384044529},{"$f":"SQRT(2*(Dashboard!$D$8)^2/(Q3*P3))*(TINV(Dashboard!$D$10,P3-1)+TINV(2*(1-Dashboard!$D$11),P3-1))","v":984.86938837551054}]
[null,2,120,{"$f":"B4*C4","v":240},{"$f":"D4*Dashboard!$D$19+D4*Cost_Estimation!$G$15+(Cost_Estimation!$G$22*Cost_Estimation!$E$20*Cost_Estimation!$E$27+Cost_Estimation!$E$23*Cost_Estimation!$E$22*Cost_Estimation!$E$27+Cost_Estimation!$G$22*Cost_Estimation!$E$21*Cost_Estimation!$E$27)/60*Cost_Estimation!$E$24 + D4*Cost_Estimation!$G$22*Cost_Estimation!$E$17*Cost_Estimation!$E$19/52*3","v":549.47621026592469},{"$f":"SQRT(2*(Dashboard!$D$8)^2/(C4*B4))*(TINV(Dashboard!$D$10,B4-1)+TINV(2*(1-Dashboard!$D$11),B4-1))","v":201.03562206724624},null,null,null,null,null,null,null,null,null,2,10,{"$f":"P4*Q4","v":20},{"$f":"R4*Dashboard!$D$19+R4*Cost_Estimation!$G$15+(Cost_Estimation!$G$22*Cost_Estimation!$E$20*Cost_Estimation!$E$27+Cost_Estimation!$E$23*Cost_Estimation!$E$22*Cost_Estimation!$E$27+Cost_Estimation!$G$22*Cost_Estimation!$E$21*Cost_Estimation!$E$27)/60*Cost_Estimation!$E$24 + R4*Cost_Estimation!$G$22*Cost_Estimation!$E$17*Cost_Estimation!$E$19/52*3","v":165.8293667285096},{"$f":"SQRT(2*(Dashboard!$D$8)^2/(Q4*P4))*(TINV(Dashboard!$D$10,P4-1)+TINV(2*(1-Dashboard!$D$11),P4-1))","v":696.40782310337102}]
[null,2,180,360,{"$f":"D5*Dashboard!$D$19+D5*Cost_Estimation!$G$15+(Cost_Estimation!$G$22*Cost_Estimation!$E$20*Cost_Estimation!$E$27+Cost_Estimation!$E$23*Cost_Estimation!$E$22*Cost_Estimation!$E$27+Cost_Estimation!$G$22*Cost_Estimation!$E$21*Cost_Estimation!$E$27)/60*Cost_Estimation!$E$24 + D5*Cost_Estimation!$G$22*Cost_Estimation!$E$17*Cost_Estimation!$E$19/52*3","v":758.73812492269644},{"$f":"SQRT(2*(Dashboard!$D$8)^2/(C5*B5))*(TINV(Dashboard!$D$10,B5-1)+TINV(2*(1-Dashboard!$D$11),B5-1))","v":164.14489806258507},null,null,null,null,null,null,null,null,null,2,15,30,{"$f":"R5*Dashboard!$D$19+R5*Cost_Estimation!$G$15+(Cost_Estimation!$G$22*Cost_Estimation!$E$20*Cost_Estimation!$E$27+Cost_Estimation!$E$23*Cost_Estimation!$E$22*Cost_Estimation!$E$27+Cost_Estimation!$G$22*Cost_Estimation!$E$21*Cost_Estimation!$E$27)/60*Cost_Estimation!$E$24 + R5*Cost_Estimation!$G$22*Cost_Estimation!$E$17*Cost_Estimation!$E$19/52*3","v":183.26785961657393},{"$f":"SQRT(2*(Dashboard!$D$8)^2/(Q5*P5))*(TINV(Dashboard!$D$10,P5-1)+TINV(2*(1-Dashboard!$D$11),P5-1))","v":568.61460649522303}]
[null,2,240,480,{"$f":"D6*Dashboard!$D$19+D6*Cost_Estimation!$G$15+(Cost_Estimation!$G$22*Cost_Estimation!$E$20*Cost_Estimation!$E$27+Cost_Estimation!$E$23*Cost_Estimation!$E$22*Cost_Estimation!$E$27+Cost_Estimation!$G$22*Cost_Estimation!$E$21*Cost_Estimation!$E$27)/60*Cost_Estimation!$E$24 + D6*Cost_Estimation!$G$22*Cost_Estimation!$E$17*Cost_Estimation!$E$19/52*3","v":968.00003957946831},{"$f":"SQRT(2*(Dashboard!$D$8)^2/(C6*B6))*(TINV(Dashboard!$D$10,B6-1)+TINV(2*(1-Dashboard!$D$11),B6-1))","v":142.15365162380576},null,null,null,null,null,null,null,null,null,2,20,40,{"$f":"R6*Dashboard!$D$19+R6*Cost_Estimation!$G$15+(Cost_Estimation!$G$22*Cost_Estimation!$E$20*Cost_Estimation!$E$27+Cost_Estimation!$E$23*Cost_Estimation!$E$22*Cost_Estimation!$E$27+Cost_Estimation!$G$22*Cost_Estimation!$E$21*Cost_Estimation!$E$27)/60*Cost_Estimation!$E$24 + R6*Cost_Estimation!$G$22*Cost_Estimation!$E$17*Cost_Estimation!$E$19/52*3","v":200.70635250463823},{"$f":"SQRT(2*(Dashboard!$D$8)^2/(Q6*P6))*(TINV(Dashboard!$D$10,P6-1)+TINV(2*(1-Dashboard!$D$11),P6-1))","v":492.43469418775527}]
[null,2,300,600,{"$f":"D7*Dashboard!$D$19+D7*Cost_Estimation!$G$15+(Cost_Estimation!$G$22*Cost_Estimation!$E$20*Cost_Estimation!$E$27+Cost_Estimation!$E$23*Cost_Estimation!$E$22*Cost_Estimation!$E$27+Cost_Estimation!$G$22*Cost_Estimation!$E$21*Cost_Estimation!$E$27)/60*Cost_Estimation!$E$24 + D7*Cost_Estimation!$G$22*Cost_Estimation!$E$17*Cost_Estimation!$E$19/52*3","v":1177.2619542362402},{"$f":"SQRT(2*(Dashboard!$D$8)^2/(C7*B7))*(TINV(Dashboard!$D$10,B7-1)+TINV(2*(1-Dashboard!$D$11),B7-1))","v":127.14609131226123},null,null,null,null,null,null,null,null,null,2,25,50,{"$f":"R7*Dashboard!$D$19+R7*Cost_Estimation!$G$15+(Cost_Estimation!$G$22*Cost_Estimation!$E$20*Cost_Estimation!$E$27+Cost_Estimation!$E$23*Cost_Estimation!$E$22*Cost_Estimation!$E$27+Cost_Estimation!$G$22*Cost_Estimation!$E$21*Cost_Estimation!$E$27)/60*Cost_Estimation!$E$24 + R7*Cost_Estimation!$G$22*Cost_Estimation!$E$17*Cost_Estimation!$E$19/52*3","v":218.14484539270256},{"$f":"SQRT(2*(Dashboard!$D$8)^2/(Q7*P7))*(TINV(Dashboard!$D$10,P7-1)+TINV(2*(1-Dashboard!$D$11),P7-1))","v":440.44698027325654}]
[null,2,360,720,{"$f":"D8*Dashboard!$D$19+D8*Cost_Estimation!$G$15+(Cost_Estimation!$G$22*Cost_Estimation!$E$20*Cost_Estimation!$E$27+Cost_Estimation!$E$23*Cost_Estimation!$E$22*Cost_Estimation!$E$27+Cost_Estimation!$G$22*Cost_Estimation!$E$21*Cost_Estimation!$E$27)/60*Cost_Estimation!$E$24 + D8*Cost_Estimation!$G$22*Cost_Estimation!$E$17*Cost_Estimation!$E$19/52*3","v":1386.5238688930119},{"$f":"SQRT(2*(Dashboard!$D$8)^2/(C8*B8))*(TINV(Dashboard!$D$10,B8-1)+TINV(2*(1-Dashboard!$D$11),B8-1))","v":116.06797051722849},null,null,null,null,null,null,null,null,null,2,30,60,{"$f":"R8*Dashboard!$D$19+R8*Cost_Estimation!$G$15+(Cost_Estimation!$G$22*Cost_Estimation!$E$20*Cost_Estimation!$E$27+Cost_Estimation!$E$23*Cost_Estimation!$E$22*Cost_Estimation!$E$27+Cost_Estimation!$G$22*Cost_Estimation!$E$21*Cost_Estimation!$E$27)/60*Cost_Estimation!$E$24 + R8*Cost_Estimation!$G$22*Cost_Estimation!$E$17*Cost_Estimation!$E$19/52*3","v":235.5833382807669},{"$f":"SQRT(2*(Dashboard!$D$8)^2/(Q8*P8))*(TINV(Dashboard!$D$10,P8-1)+TINV(2*(1-Dashboard!$D$11),P8-1))","v":402.07124413449247}]
[null,2,420,840,{"$f":"D9*Dashboard!$D$19+D9*Cost_Estimation!$G$15+(Cost_Estimation!$G$22*Cost_Estimation!$E$20*Cost_Estimation!$E$27+Cost_Estimation!$E$23*Cost_Estimation!$E$22*Cost_Estimation!$E$27+Cost_Estimation!$G$22*Cost_Estimation!$E$21*Cost_Estimation!$E$27)/60*Cost_Estimation!$E$24 + D9*Cost_Estimation!$G$22*Cost_Estimation!$E$17*Cost_Estimation!$E$19/52*3","v":1595.7857835497839},{"$f":"SQRT(2*(Dashboard!$D$8)^2/(C9*B9))*(TINV(Dashboard!$D$10,B9-1)+TINV(2*(1-Dashboard!$D$11),B9-1))","v":107.45806004465805},null,null,null,null,null,null,null,null,null,2,35,70,{"$f":"R9*Dashboard!$D$19+R9*Cost_Estimation!$G$15+(Cost_Estimation!$G$22*Cost_Estimation!$E$20*Cost_Estimation!$E$27+Cost_Estimation!$E$23*Cost_Estimation!$E$22*Cost_Estimation!$E$27+Cost_Estimation!$G$22*Cost_Estimation!$E$21*Cost_Estimation!$E$27)/60*Cost_Estimation!$E$24 + R9*Cost_Estimation!$G$22*Cost_Estimation!$E$17*Cost_Estimation!$E$19/52*3","v":253.02183116883123},{"$f":"SQRT(2*(Dashboard!$D$8)^2/(Q9*P9))*(TINV(Dashboard!$D$10,P9-1)+TINV(2*(1-Dashboard!$D$11),P9-1))","v":372.24563936026976}]
[null,2,480,960,{"$f":"D10*Dashboard!$D$19+D10*Cost_Estimation!$G$15+(Cost_Estimation!$G$22*Cost_Estimation!$E$20*Cost_Estimation!$E$27+Cost_Estimation!$E$23*Cost_Estimation!$E$22*Cost_Estimation!$E$27+Cost_Estimation!$G$22*Cost_Estimation!$E$21*Cost_Estimation!$E$27)/60*Cost_Estimation!$E$24 + D10*Cost_Estimation!$G$22*Cost_Estimation!$E$17*Cost_Estimation!$E$19/52*3","v":1805.0476982065557},{"$f":"SQRT(2*(Dashboard!$D$8)^2/(C10*B10))*(TINV(Dashboard!$D$10,B10-1)+TINV(2*(1-Dashboard!$D$11),B10-1))","v":100.51781103362312},null,null,null,null,null,null,null,null,null,2,40,80,{"$f":"R10*Dashboard!$D$19+R10*Cost_Estimation!$G$15+(Cost_Estimation!$G$22*Cost_Estimation!$E$20*Cost_Estimation!$E$27+Cost_Estimation!$E$23*Cost_Estimation!$E$22*Cost_Estimation!$E$27+Cost_Estimation!$G$22*Cost_Estimation!$E$21*Cost_Estimation!$E$27)/60*Cost_Estimation!$E$24 + R10*Cost_Estimation!$G$22*Cost_Estimation!$E$17*Cost_Estimation!$E$19/52*3","v":270.4603240568955},{"$f":"SQRT(2*(Dashboard!$D$8)^2/(Q10*P10))*(TINV(Dashboard!$D$10,P10-1)+TINV(2*(1-Dashboard!$D$11),P10-1))","v":348.20391155168551}]
[null,2,540,1080,{"$f":"D11*Dashboard!$D$19+D11*Cost_Estimation!$G$15+(Cost_Estimation!$G$22*Cost_Estimation!$E$20*Cost_Estimation!$E$27+Cost_Estimation!$E$23*Cost_Estimation!$E$22*Cost_Estimation!$E$27+Cost_Estimation!$G$22*Cost_Estimation!$E$21*Cost_Estimation!$E$27)/60*Cost_Estimation!$E$24 + D11*Cost_Estimation!$G$22*Cost_Estimation!$E$17*Cost_Estimation!$E$19/52*3","v":2014.3096128633276},{"$f":"SQRT(2*(Dashboard!$D$8)^2/(C11*B11))*(TINV(Dashboard!$D$10,B11-1)+TINV(2*(1-Dashboard!$D$11),B11-1))","v":94.769101082537176},null,null,null,null,null,null,null,null,null,2,45,90,{"$f":"R11*Dashboard!$D$19+R11*Cost_Estimation!$G$15+(Cost_Estimation!$G$22*Cost_Estimation!$E$20*Cost_Estimation!$E$27+Cost_Estimation!$E$23*Cost_Estimation!$E$22*Cost_Estimation!$E$27+Cost_Estimation!$G$22*Cost_Estimation!$E$21*Cost_Estimation!$E$27)/60*Cost_Estimation!$E$24 + R11*Cost_Estimation!$G$22*Cost_Estimation!$E$17*Cost_Estimation!$E$19/52*3","v":287.89881694495983},{"$f":"SQRT(2*(Dashboard!$D$8)^2/(Q11*P11))*(TINV(Dashboard!$D$10,P11-1)+TINV(2*(1-Dashboard!$D$11),P11-1))","v":328.28979612517014}]
[null,2,600,1200,{"$f":"D12*Dashboard!$D$19+D12*Cost_Estimation!$G$15+(Cost_Estimation!$G$22*Cost_Estimation!$E$20*Cost_Estimation!$E$27+Cost_Estimation!$E$23*Cost_Estimation!$E$22*Cost_Estimation!$E$27+Cost_Estimation!$G$22*Cost_Estimation!$E$21*Cost_Estimation!$E$27)/60*Cost_Estimation!$E$24 + D12*Cost_Estimation!$G$22*Cost_Estimation!$E$17*Cost_Estimation!$E$19/52*3","v":2223.5715275200992},{"$f":"SQRT(2*(Dashboard!$D$8)^2/(C12*B12))*(TINV(Dashboard!$D$10,B12-1)+TINV(2*(1-Dashboard!$D$11),B12-1))","v":89.905863368263894},null,null,null,null,null,null,null,null,null,2,50,100,{"$f":"R12*Dashboard!$D$19+R12*Cost_Estimation!$G$15+(Cost_Estimation!$G$22*Cost_Estimation!$E$20*Cost_Estimation!$E$27+Cost_Estimation!$E$23*Cost_Estimation!$E$22*Cost_Estimation!$E$27+Cost_Estimation!$G$22*Cost_Estimation!$E$21*Cost_Estimation!$E$27)/60*Cost_Estimation!$E$24 + R12*Cost_Estimation!$G$22*Cost_Estimation!$E$17*Cost_Estimation!$E$19/52*3","v":305.33730983302416},{"$f":"SQRT(2*(Dashboard!$D$8)^2/(Q12*P12))*(TINV(Dashboard!$D$10,P12-1)+TINV(2*(1-Dashboard!$D$11),P12-1))","v":311.44304650435726}]
[null,2,660,1320,{"$f":"D13*Dashboard!$D$19+D13*Cost_Estimation!$G$15+(Cost_Estimation!$G$22*Cost_Estimation!$E$20*Cost_Estimation!$E$27+Cost_Estimation!$E$23*Cost_Estimation!$E$22*Cost_Estimation!$E$27+Cost_Estimation!$G$22*Cost_Estimation!$E$21*Cost_Estimation!$E$27)/60*Cost_Estimation!$E$24 + D13*Cost_Estimation!$G$22*Cost_Estimation!$E$17*Cost_Estimation!$E$19/52*3","v":2432.8334421768714},{"$f":"SQRT(2*(Dashboard!$D$8)^2/(C13*B13))*(TINV(Dashboard!$D$10,B13-1)+TINV(2*(1-Dashboard!$D$11),B13-1))","v":85.721877275465332},null,null,null,null,null,null,null,null,null,2,55,110,{"$f":"R13*Dashboard!$D$19+R13*Cost_Estimation!$G$15+(Cost_Estimation!$G$22*Cost_Estimation!$E$20*Cost_Estimation!$E$27+Cost_Estimation!$E$23*Cost_Estimation!$E$22*Cost_Estimation!$E$27+Cost_Estimation!$G$22*Cost_Estimation!$E$21*Cost_Estimation!$E$27)/60*Cost_Estimation!$E$24 + R13*Cost_Estimation!$G$22*Cost_Estimation!$E$17*Cost_Estimation!$E$19/52*3","v":322.7758027210885},{"$f":"SQRT(2*(Dashboard!$D$8)^2/(Q13*P13))*(TINV(Dashboard!$D$10,P13-1)+TINV(2*(1-Dashboard!$D$11),P13-1))","v":296.94929352257986}]
[null,2,720,1440,{"$f":"D14*Dashboard!$D$19+D14*Cost_Estimation!$G$15+(Cost_Estimation!$G$22*Cost_Estimation!$E$20*Cost_Estimation!$E$27+Cost_Estimation!$E$23*Cost_Estimation!$E$22*Cost_Estimation!$E$27+Cost_Estimation!$G$22*Cost_Estimation!$E$21*Cost_Estimation!$E$27)/60*Cost_Estimation!$E$24 + D14*Cost_Estimation!$G$22*Cost_Estimation!$E$17*Cost_Estimation!$E$19/52*3","v":2642.0953568336427},{"$f":"SQRT(2*(Dashboard!$D$8)^2/(C14*B14))*(TINV(Dashboard!$D$10,B14-1)+TINV(2*(1-Dashboard!$D$11),B14-1))","v":82.072449031292535},null,null,null,null,null,null,null,null,null,2,60,120,{"$f":"R14*Dashboard!$D$19+R14*Cost_Estimation!$G$15+(Cost_Estimation!$G$22*Cost_Estimation!$E$20*Cost_Estimation!$E$27+Cost_Estimation!$E$23*Cost_Estimation!$E$22*Cost_Estimation!$E$27+Cost_Estimation!$G$22*Cost_Estimation!$E$21*Cost_Estimation!$E$27)/60*Cost_Estimation!$E$24 + R14*Cost_Estimation!$G$22*Cost_Estimation!$E$17*Cost_Estimation!$E$19/52*3","v":340.21429560915283},{"$f":"SQRT(2*(Dashboard!$D$8)^2/(Q14*P14))*(TINV(Dashboard!$D$10,P14-1)+TINV(2*(1-Dashboard!$D$11),P14-1))","v":284.30730324761151}]
[null,2,780,1560,{"$f":"D15*Dashboard!$D$19+D15*Cost_Estimation!$G$15+(Cost_Estimation!$G$22*Cost_Estimation!$E$20*Cost_Estimation!$E$27+Cost_Estimation!$E$23*Cost_Estimation!$E$22*Cost_Estimation!$E$27+Cost_Estimation!$G$22*Cost_Estimation!$E$21*Cost_Estimation!$E$27)/60*Cost_Estimation!$E$24 + D15*Cost_Estimation!$G$22*Cost_Estimation!$E$17*Cost_Estimation!$E$19/52*3","v":2851.3572714904149},{"$f":"SQRT(2*(Dashboard!$D$8)^2/(C15*B15))*(TINV(Dashboard!$D$10,B15-1)+TINV(2*(1-Dashboard!$D$11),B15-1))","v":78.852658449857927},null,null,null,null,null,null,null,null,null,2,65,130,{"$f":"R15*Dashboard!$D$19+R15*Cost_Estimation!$G$15+(Cost_Estimation!$G$22*Cost_Estimation!$E$20*Cost_Estimation!$E$27+Cost_Estimation!$E$23*Cost_Estimation!$E$22*Cost_Estimation!$E$27+Cost_Estimation!$G$22*Cost_Estimation!$E$21*Cost_Estimation!$E$27)/60*Cost_Estimation!$E$24 + R15*Cost_Estimation!$G$22*Cost_Estimation!$E$17*Cost_Estimation!$E$19/52*3","v":357.6527884972171},{"$f":"SQRT(2*(Dashboard!$D$8)^2/(Q15*P15))*(TINV(Dashboard!$D$10,P15-1)+TINV(2*(1-Dashboard!$D$11),P15-1))","v":273.15362149405854}]
{"$rows_left_out":88}